{"text_format":"1","workbook":"xlsx","n_sheets":10,"sheets":["Cover","Navigator","Style Guide","Original Data","Method 1 - Using TREND","Method 2 - Using TREND + CAGR","Method 3 - Using FORECAST.ETS","Raw Data from FORECAST.ETS","Model Parameters","Error Checks"],"not_rendered":{"charts":5,"images":1,"macros":1,"external_links":0,"defined_names":35,"comments":0,"pivot_tables":0},"unopened":[],"bounds":{"document_bytes":16777216,"sheet_cells":100000,"rows_first":2000,"rows_last":500,"rows_between":2000,"halvings":0,"cell_chars":16384,"cell_head_chars":4096},"cells_cut":0,"cells_raw":0,"read":"whole","date_system":"1900"}

{"sheet":"Cover","index":0,"n_rows":22,"n_cols":7,"rows_kept":22,"cut":false,"hidden":false,"merged":[[16,2,16,9],[17,2,17,9],[20,6,20,8],[21,6,21,8]]}
[]
[]
["Navigator"]
[]
[null,null,{"$f":"Client_Name","v":"ICAEW"}]
[null,null,{"$f":"Model_Name","v":"SP Forecasting Examples.xlsm"}]
[]
[]
[]
[]
[]
[]
[]
[null,null,"Primary Developer:  Liam Bastick"]
[]
[null,null,"General Cover Notes:"]
[null,null,"Comparing forecasting objectively using TREND and cyclical growth rates with the Forecast Sheet functionality."]
[]
[]
[]
[null,null,"Any queries, please e-mail:",null,null,null,"liam.bastick@sumproduct.com"]
[null,null,"Website:",null,null,null,"www.sumproduct.com"]

{"sheet":"Navigator","index":1,"n_rows":17,"n_cols":7,"rows_kept":17,"cut":false,"hidden":false,"merged":[]}
["Navigator"]
[{"$f":"Model_Name","v":"SP Forecasting Examples.xlsm"}]
["Navigator"]
[null,null,null,null,"Error Checks:",null,{"$f":"Overall_Error_Check","v":0}]
[]
[]
[null,1,"Table of Contents"]
[]
[null,null,null,null,null,"Cover"]
[null,null,null,null,null,"Style Guide"]
[null,null,null,null,null,"Original Data"]
[null,null,null,null,null,"Method 1 - Using TREND"]
[null,null,null,null,null,"Method 2 - Using TREND + CAGR"]
[null,null,null,null,null,"Method 3 - Using FORECAST.ETS"]
[null,null,null,null,null,"Raw Data from FORECAST.ETS"]
[null,null,null,null,null,"Model Parameters"]
[null,null,null,null,null,"Error Checks"]

{"sheet":"Style Guide","index":2,"n_rows":74,"n_cols":11,"rows_kept":74,"cut":false,"hidden":false,"merged":[[80,2,80,6],[74,2,74,6],[75,2,75,6],[76,2,76,6],[77,2,77,6],[78,2,78,6],[79,2,79,6],[73,2,73,6],[62,2,62,6],[63,2,63,6],[64,2,64,6],[65,2,65,6],[66,2,66,6],[67,2,67,6],[68,2,68,6],[69,2,69,6],[70,2,70,6],[71,2,71,6],[72,2,72,6],[61,2,61,6],[47,2,47,6],[48,2,48,6],[49,2,49,6],[50,2,50,6],[51,2,51,6],[52,2,52,6],[53,2,53,6],[54,2,54,6],[57,2,57,6],[59,2,59,6],[60,2,60,6],[46,2,46,6],[35,2,35,6],[36,2,36,6],[37,2,37,6],[38,2,38,6],[39,2,39,6],[40,2,40,6],[41,2,41,6],[42,2,42,6],[43,2,43,6],[44,2,44,6],[45,2,45,6],[34,2,34,6],[17,2,17,6],[18,2,18,6],[19,2,19,6],[24,2,24,6],[25,2,25,6],[26,2,26,6],[27,2,27,6],[28,2,28,6],[29,2,29,6],[30,2,30,6],[31,2,31,6],[16,2,16,6],[2,0,2,4],[7,2,7,6],[8,2,8,6],[9,2,9,6],[10,2,10,6],[11,2,11,6],[12,2,12,6],[13,2,13,6],[14,2,14,6],[15,2,15,6]]}
[{"$f":"IF(ISERROR(RIGHT(CELL(\"filename\",A1),LEN(CELL(\"filename\",A1))-FIND(\"]\",CELL(\"filename\",A1)))),\n\"\",\nRIGHT(CELL(\"filename\",A1),LEN(CELL(\"filename\",A1))-FIND(\"]\",CELL(\"filename\",A1))))","v":"Style Guide"}]
[{"$f":"Model_Name","v":"SP Forecasting Examples.xlsm"}]
["Navigator"]
[null,null,null,null,"Error Checks:",null,null,null,{"$f":"Overall_Error_Check","v":0}]
[]
[null,{"$f":"MAX($B$5:$B5)+1","v":1},"Formatting of Headers / Dividers"]
[]
[null,null,"Description",null,null,null,null,null,"Display",null,"Style Name"]
[]
[null,null,"Sheet Title",null,null,null,null,null,{"$f":"C10","v":"Sheet Title"},null,"Sheet Title"]
[null,null,"Model Name",null,null,null,null,null,{"$f":"C11","v":"Model Name"},null,"Model Name"]
[]
[null,null,"Header 1",null,null,null,null,null,{"$f":"C13","v":"Header 1"},null,"Header 1"]
[null,null,"Header 2",null,null,null,null,null,{"$f":"C14","v":"Header 2"},null,"Header 2"]
[null,null,"Header 3",null,null,null,null,null,{"$f":"C15","v":"Header 3"},null,"Header 3"]
[null,null,"Header 4",null,null,null,null,null,{"$f":"C16","v":"Header 4"},null,"Header 4"]
[]
[null,null,"Notes",null,null,null,null,null,{"$f":"C18","v":"Notes"},null,"Notes"]
[]
[null,null,"Table Heading",null,null,null,null,null,{"$f":"C20","v":"Table Heading"},null,"Table Heading"]
[]
[]
[null,{"$f":"MAX($B$5:$B22)+1","v":2},"Individual Cell Styles"]
[]
[null,null,"Description",null,null,null,null,null,"Display",null,"Style Name"]
[]
[null,null,"Assumption",null,null,null,null,null,"Assumption",null,{"$f":"C27","v":"Assumption"}]
[]
[null,null,"Constraint",null,null,null,null,null,{"$f":"C29","v":"Constraint"},null,{"$f":"C29","v":"Constraint"}]
[]
{"$rows_left_out":45}
{"sheet":"Original Data","index":3,"n_rows":112,"n_cols":9,"rows_kept":112,"cut":false,"hidden":false,"merged":[[0,9,0,10],[2,0,2,4]]}
[{"$f":"IF(ISERROR(RIGHT(CELL(\"filename\",A1),LEN(CELL(\"filename\",A1))-FIND(\"]\",CELL(\"filename\",A1)))),\n\"\",\nRIGHT(CELL(\"filename\",A1),LEN(CELL(\"filename\",A1))-FIND(\"]\",CELL(\"filename\",A1))))","v":"Original Data"}]
[{"$f":"Model_Name","v":"SP Forecasting Examples.xlsm"}]
["Navigator"]
[null,null,null,null,"Error Checks:",null,null,null,{"$f":"Overall_Error_Check","v":0}]
[]
[null,{"$f":"MAX($B$5:$B5)+1","v":1},"Historical Information"]
[]
[null,null,"Key Inputs"]
[]
[null,null,null,null,"General"]
[]
[null,null,null,null,null,"Date","Sales"]
[null,null,null,null,null,"2012-09-30",2644539]
[null,null,null,null,null,{"$f":"EOMONTH(F13,1)","v":"2012-10-31"},2359800]
[null,null,null,null,null,{"$f":"EOMONTH(F14,1)","v":"2012-11-30"},2925918]
[null,null,null,null,null,"2012-12-31",3024973]
[null,null,null,null,null,"2013-01-31",3177100]
[null,null,null,null,null,"2013-02-28",3419595]
[null,null,null,null,null,"2013-03-31",3649702]
[null,null,null,null,null,"2013-04-30",3650668]
[null,null,null,null,null,"2013-05-31",3191526]
[null,null,null,null,null,"2013-06-30",3249428]
[null,null,null,null,null,"2013-07-31",2971484]
[null,null,null,null,null,"2013-08-31",3074209]
[null,null,null,null,null,"2013-09-30",2785466]
[null,null,null,null,null,"2013-10-31",2515361]
[null,null,null,null,null,"2013-11-30",3105958]
[null,null,null,null,null,"2013-12-31",3139059]
[null,null,null,null,null,"2014-01-31",3380355]
[null,null,null,null,null,"2014-02-28",3612886]
{"$rows_left_out":83}
{"sheet":"Method 1 - Using TREND","index":4,"n_rows":112,"n_cols":9,"rows_kept":112,"cut":false,"hidden":false,"merged":[[0,9,0,10],[2,0,2,4]]}
[{"$f":"IF(ISERROR(RIGHT(CELL(\"filename\",A1),LEN(CELL(\"filename\",A1))-FIND(\"]\",CELL(\"filename\",A1)))),\n\"\",\nRIGHT(CELL(\"filename\",A1),LEN(CELL(\"filename\",A1))-FIND(\"]\",CELL(\"filename\",A1))))","v":"Method 1 - Using TREND"}]
[{"$f":"Model_Name","v":"SP Forecasting Examples.xlsm"}]
["Navigator"]
[null,null,null,null,"Error Checks:",null,null,null,{"$f":"Overall_Error_Check","v":0}]
[]
[null,{"$f":"MAX($B$5:$B5)+1","v":1},"Historical Information"]
[]
[null,null,"Key Inputs"]
[]
[null,null,null,null,"General"]
[]
[null,null,null,null,null,"Date","Sales","TREND","Combined"]
[null,null,null,null,null,{"$f":"IF('Original Data'!F13=\"\",\"\",'Original Data'!F13)","v":"2012-09-30"},{"$f":"IF('Original Data'!G13=\"\",\"\",'Original Data'!G13)","v":2644539},null,{"$f":"N(G13)+N(H13)","v":2644539}]
[null,null,null,null,null,{"$f":"IF('Original Data'!F14=\"\",\"\",'Original Data'!F14)","v":"2012-10-31"},{"$f":"IF('Original Data'!G14=\"\",\"\",'Original Data'!G14)","v":2359800},null,{"$f":"N(G14)+N(H14)","v":2359800}]
[null,null,null,null,null,{"$f":"IF('Original Data'!F15=\"\",\"\",'Original Data'!F15)","v":"2012-11-30"},{"$f":"IF('Original Data'!G15=\"\",\"\",'Original Data'!G15)","v":2925918},null,2925918]
[null,null,null,null,null,{"$f":"IF('Original Data'!F16=\"\",\"\",'Original Data'!F16)","v":"2012-12-31"},{"$f":"IF('Original Data'!G16=\"\",\"\",'Original Data'!G16)","v":3024973},null,3024973]
[null,null,null,null,null,{"$f":"IF('Original Data'!F17=\"\",\"\",'Original Data'!F17)","v":"2013-01-31"},{"$f":"IF('Original Data'!G17=\"\",\"\",'Original Data'!G17)","v":3177100},null,3177100]
[null,null,null,null,null,{"$f":"IF('Original Data'!F18=\"\",\"\",'Original Data'!F18)","v":"2013-02-28"},{"$f":"IF('Original Data'!G18=\"\",\"\",'Original Data'!G18)","v":3419595},null,3419595]
[null,null,null,null,null,{"$f":"IF('Original Data'!F19=\"\",\"\",'Original Data'!F19)","v":"2013-03-31"},{"$f":"IF('Original Data'!G19=\"\",\"\",'Original Data'!G19)","v":3649702},null,3649702]
[null,null,null,null,null,{"$f":"IF('Original Data'!F20=\"\",\"\",'Original Data'!F20)","v":"2013-04-30"},{"$f":"IF('Original Data'!G20=\"\",\"\",'Original Data'!G20)","v":3650668},null,3650668]
[null,null,null,null,null,{"$f":"IF('Original Data'!F21=\"\",\"\",'Original Data'!F21)","v":"2013-05-31"},{"$f":"IF('Original Data'!G21=\"\",\"\",'Original Data'!G21)","v":3191526},null,3191526]
[null,null,null,null,null,{"$f":"IF('Original Data'!F22=\"\",\"\",'Original Data'!F22)","v":"2013-06-30"},{"$f":"IF('Original Data'!G22=\"\",\"\",'Original Data'!G22)","v":3249428},null,3249428]
[null,null,null,null,null,{"$f":"IF('Original Data'!F23=\"\",\"\",'Original Data'!F23)","v":"2013-07-31"},{"$f":"IF('Original Data'!G23=\"\",\"\",'Original Data'!G23)","v":2971484},null,2971484]
[null,null,null,null,null,{"$f":"IF('Original Data'!F24=\"\",\"\",'Original Data'!F24)","v":"2013-08-31"},{"$f":"IF('Original Data'!G24=\"\",\"\",'Original Data'!G24)","v":3074209},null,3074209]
[null,null,null,null,null,{"$f":"IF('Original Data'!F25=\"\",\"\",'Original Data'!F25)","v":"2013-09-30"},{"$f":"IF('Original Data'!G25=\"\",\"\",'Original Data'!G25)","v":2785466},null,2785466]
[null,null,null,null,null,{"$f":"IF('Original Data'!F26=\"\",\"\",'Original Data'!F26)","v":"2013-10-31"},{"$f":"IF('Original Data'!G26=\"\",\"\",'Original Data'!G26)","v":2515361},null,2515361]
[null,null,null,null,null,{"$f":"IF('Original Data'!F27=\"\",\"\",'Original Data'!F27)","v":"2013-11-30"},{"$f":"IF('Original Data'!G27=\"\",\"\",'Original Data'!G27)","v":3105958},null,3105958]
[null,null,null,null,null,{"$f":"IF('Original Data'!F28=\"\",\"\",'Original Data'!F28)","v":"2013-12-31"},{"$f":"IF('Original Data'!G28=\"\",\"\",'Original Data'!G28)","v":3139059},null,3139059]
[null,null,null,null,null,{"$f":"IF('Original Data'!F29=\"\",\"\",'Original Data'!F29)","v":"2014-01-31"},{"$f":"IF('Original Data'!G29=\"\",\"\",'Original Data'!G29)","v":3380355},null,3380355]
[null,null,null,null,null,{"$f":"IF('Original Data'!F30=\"\",\"\",'Original Data'!F30)","v":"2014-02-28"},{"$f":"IF('Original Data'!G30=\"\",\"\",'Original Data'!G30)","v":3612886},null,3612886]
{"$rows_left_out":83}
{"sheet":"Method 2 - Using TREND + CAGR","index":5,"n_rows":112,"n_cols":16,"rows_kept":112,"cut":false,"hidden":false,"merged":[[0,9,0,10],[2,0,2,4]]}
[{"$f":"IF(ISERROR(RIGHT(CELL(\"filename\",A1),LEN(CELL(\"filename\",A1))-FIND(\"]\",CELL(\"filename\",A1)))),\n\"\",\nRIGHT(CELL(\"filename\",A1),LEN(CELL(\"filename\",A1))-FIND(\"]\",CELL(\"filename\",A1))))","v":"Method 2 - Using TREND + CAGR"}]
[{"$f":"Model_Name","v":"SP Forecasting Examples.xlsm"}]
["Navigator"]
[null,null,null,null,"Error Checks:",null,null,null,{"$f":"Overall_Error_Check","v":0}]
[]
[null,{"$f":"MAX($B$5:$B5)+1","v":1},"Historical Information"]
[]
[null,null,"Key Inputs"]
[]
[null,null,null,null,"General"]
[]
[null,null,null,null,null,"Date","Sales","TREND","Combined"]
[null,null,null,null,null,{"$f":"IF('Original Data'!F13=\"\",\"\",'Original Data'!F13)","v":"2012-09-30"},{"$f":"IF('Original Data'!G13=\"\",\"\",'Original Data'!G13)","v":2644539},null,{"$f":"IF($G13=\"\",OFFSET($I13,-$P$36,)*(1+$P$45),$G13)","v":2644539}]
[null,null,null,null,null,{"$f":"IF('Original Data'!F14=\"\",\"\",'Original Data'!F14)","v":"2012-10-31"},{"$f":"IF('Original Data'!G14=\"\",\"\",'Original Data'!G14)","v":2359800},null,{"$f":"IF($G14=\"\",OFFSET($I14,-$P$36,)*(1+$P$45),$G14)","v":2359800}]
[null,null,null,null,null,{"$f":"IF('Original Data'!F15=\"\",\"\",'Original Data'!F15)","v":"2012-11-30"},{"$f":"IF('Original Data'!G15=\"\",\"\",'Original Data'!G15)","v":2925918},null,2925918]
[null,null,null,null,null,{"$f":"IF('Original Data'!F16=\"\",\"\",'Original Data'!F16)","v":"2012-12-31"},{"$f":"IF('Original Data'!G16=\"\",\"\",'Original Data'!G16)","v":3024973},null,3024973]
[null,null,null,null,null,{"$f":"IF('Original Data'!F17=\"\",\"\",'Original Data'!F17)","v":"2013-01-31"},{"$f":"IF('Original Data'!G17=\"\",\"\",'Original Data'!G17)","v":3177100},null,3177100]
[null,null,null,null,null,{"$f":"IF('Original Data'!F18=\"\",\"\",'Original Data'!F18)","v":"2013-02-28"},{"$f":"IF('Original Data'!G18=\"\",\"\",'Original Data'!G18)","v":3419595},null,3419595]
[null,null,null,null,null,{"$f":"IF('Original Data'!F19=\"\",\"\",'Original Data'!F19)","v":"2013-03-31"},{"$f":"IF('Original Data'!G19=\"\",\"\",'Original Data'!G19)","v":3649702},null,3649702]
[null,null,null,null,null,{"$f":"IF('Original Data'!F20=\"\",\"\",'Original Data'!F20)","v":"2013-04-30"},{"$f":"IF('Original Data'!G20=\"\",\"\",'Original Data'!G20)","v":3650668},null,3650668]
[null,null,null,null,null,{"$f":"IF('Original Data'!F21=\"\",\"\",'Original Data'!F21)","v":"2013-05-31"},{"$f":"IF('Original Data'!G21=\"\",\"\",'Original Data'!G21)","v":3191526},null,3191526]
[null,null,null,null,null,{"$f":"IF('Original Data'!F22=\"\",\"\",'Original Data'!F22)","v":"2013-06-30"},{"$f":"IF('Original Data'!G22=\"\",\"\",'Original Data'!G22)","v":3249428},null,3249428]
[null,null,null,null,null,{"$f":"IF('Original Data'!F23=\"\",\"\",'Original Data'!F23)","v":"2013-07-31"},{"$f":"IF('Original Data'!G23=\"\",\"\",'Original Data'!G23)","v":2971484},null,2971484]
[null,null,null,null,null,{"$f":"IF('Original Data'!F24=\"\",\"\",'Original Data'!F24)","v":"2013-08-31"},{"$f":"IF('Original Data'!G24=\"\",\"\",'Original Data'!G24)","v":3074209},null,3074209]
[null,null,null,null,null,{"$f":"IF('Original Data'!F25=\"\",\"\",'Original Data'!F25)","v":"2013-09-30"},{"$f":"IF('Original Data'!G25=\"\",\"\",'Original Data'!G25)","v":2785466},null,2785466]
[null,null,null,null,null,{"$f":"IF('Original Data'!F26=\"\",\"\",'Original Data'!F26)","v":"2013-10-31"},{"$f":"IF('Original Data'!G26=\"\",\"\",'Original Data'!G26)","v":2515361},null,2515361]
[null,null,null,null,null,{"$f":"IF('Original Data'!F27=\"\",\"\",'Original Data'!F27)","v":"2013-11-30"},{"$f":"IF('Original Data'!G27=\"\",\"\",'Original Data'!G27)","v":3105958},null,3105958]
[null,null,null,null,null,{"$f":"IF('Original Data'!F28=\"\",\"\",'Original Data'!F28)","v":"2013-12-31"},{"$f":"IF('Original Data'!G28=\"\",\"\",'Original Data'!G28)","v":3139059},null,3139059]
[null,null,null,null,null,{"$f":"IF('Original Data'!F29=\"\",\"\",'Original Data'!F29)","v":"2014-01-31"},{"$f":"IF('Original Data'!G29=\"\",\"\",'Original Data'!G29)","v":3380355},null,3380355]
[null,null,null,null,null,{"$f":"IF('Original Data'!F30=\"\",\"\",'Original Data'!F30)","v":"2014-02-28"},{"$f":"IF('Original Data'!G30=\"\",\"\",'Original Data'!G30)","v":3612886},null,3612886]
{"$rows_left_out":83}
{"sheet":"Method 3 - Using FORECAST.ETS","index":6,"n_rows":112,"n_cols":9,"rows_kept":112,"cut":false,"hidden":false,"merged":[[0,9,0,10],[2,0,2,4]]}
[{"$f":"IF(ISERROR(RIGHT(CELL(\"filename\",A1),LEN(CELL(\"filename\",A1))-FIND(\"]\",CELL(\"filename\",A1)))),\n\"\",\nRIGHT(CELL(\"filename\",A1),LEN(CELL(\"filename\",A1))-FIND(\"]\",CELL(\"filename\",A1))))","v":"Method 3 - Using FORECAST.ETS"}]
[{"$f":"Model_Name","v":"SP Forecasting Examples.xlsm"}]
["Navigator"]
[null,null,null,null,"Error Checks:",null,null,null,{"$f":"Overall_Error_Check","v":0}]
[]
[null,{"$f":"MAX($B$5:$B5)+1","v":1},"Historical Information"]
[]
[null,null,"Key Inputs"]
[]
[null,null,null,null,"General"]
[]
[null,null,null,null,null,"Date","Sales"]
[null,null,null,null,null,{"$f":"IF('Original Data'!F13=\"\",\"\",'Original Data'!F13)","v":"2012-09-30"},{"$f":"IF('Original Data'!G13=\"\",\"\",'Original Data'!G13)","v":2644539}]
[null,null,null,null,null,{"$f":"IF('Original Data'!F14=\"\",\"\",'Original Data'!F14)","v":"2012-10-31"},{"$f":"IF('Original Data'!G14=\"\",\"\",'Original Data'!G14)","v":2359800}]
[null,null,null,null,null,{"$f":"IF('Original Data'!F15=\"\",\"\",'Original Data'!F15)","v":"2012-11-30"},{"$f":"IF('Original Data'!G15=\"\",\"\",'Original Data'!G15)","v":2925918}]
[null,null,null,null,null,{"$f":"IF('Original Data'!F16=\"\",\"\",'Original Data'!F16)","v":"2012-12-31"},{"$f":"IF('Original Data'!G16=\"\",\"\",'Original Data'!G16)","v":3024973}]
[null,null,null,null,null,{"$f":"IF('Original Data'!F17=\"\",\"\",'Original Data'!F17)","v":"2013-01-31"},{"$f":"IF('Original Data'!G17=\"\",\"\",'Original Data'!G17)","v":3177100}]
[null,null,null,null,null,{"$f":"IF('Original Data'!F18=\"\",\"\",'Original Data'!F18)","v":"2013-02-28"},{"$f":"IF('Original Data'!G18=\"\",\"\",'Original Data'!G18)","v":3419595}]
[null,null,null,null,null,{"$f":"IF('Original Data'!F19=\"\",\"\",'Original Data'!F19)","v":"2013-03-31"},{"$f":"IF('Original Data'!G19=\"\",\"\",'Original Data'!G19)","v":3649702}]
[null,null,null,null,null,{"$f":"IF('Original Data'!F20=\"\",\"\",'Original Data'!F20)","v":"2013-04-30"},{"$f":"IF('Original Data'!G20=\"\",\"\",'Original Data'!G20)","v":3650668}]
[null,null,null,null,null,{"$f":"IF('Original Data'!F21=\"\",\"\",'Original Data'!F21)","v":"2013-05-31"},{"$f":"IF('Original Data'!G21=\"\",\"\",'Original Data'!G21)","v":3191526}]
[null,null,null,null,null,{"$f":"IF('Original Data'!F22=\"\",\"\",'Original Data'!F22)","v":"2013-06-30"},{"$f":"IF('Original Data'!G22=\"\",\"\",'Original Data'!G22)","v":3249428}]
[null,null,null,null,null,{"$f":"IF('Original Data'!F23=\"\",\"\",'Original Data'!F23)","v":"2013-07-31"},{"$f":"IF('Original Data'!G23=\"\",\"\",'Original Data'!G23)","v":2971484}]
[null,null,null,null,null,{"$f":"IF('Original Data'!F24=\"\",\"\",'Original Data'!F24)","v":"2013-08-31"},{"$f":"IF('Original Data'!G24=\"\",\"\",'Original Data'!G24)","v":3074209}]
[null,null,null,null,null,{"$f":"IF('Original Data'!F25=\"\",\"\",'Original Data'!F25)","v":"2013-09-30"},{"$f":"IF('Original Data'!G25=\"\",\"\",'Original Data'!G25)","v":2785466}]
[null,null,null,null,null,{"$f":"IF('Original Data'!F26=\"\",\"\",'Original Data'!F26)","v":"2013-10-31"},{"$f":"IF('Original Data'!G26=\"\",\"\",'Original Data'!G26)","v":2515361}]
[null,null,null,null,null,{"$f":"IF('Original Data'!F27=\"\",\"\",'Original Data'!F27)","v":"2013-11-30"},{"$f":"IF('Original Data'!G27=\"\",\"\",'Original Data'!G27)","v":3105958}]
[null,null,null,null,null,{"$f":"IF('Original Data'!F28=\"\",\"\",'Original Data'!F28)","v":"2013-12-31"},{"$f":"IF('Original Data'!G28=\"\",\"\",'Original Data'!G28)","v":3139059}]
[null,null,null,null,null,{"$f":"IF('Original Data'!F29=\"\",\"\",'Original Data'!F29)","v":"2014-01-31"},{"$f":"IF('Original Data'!G29=\"\",\"\",'Original Data'!G29)","v":3380355}]
[null,null,null,null,null,{"$f":"IF('Original Data'!F30=\"\",\"\",'Original Data'!F30)","v":"2014-02-28"},{"$f":"IF('Original Data'!G30=\"\",\"\",'Original Data'!G30)","v":3612886}]
{"$rows_left_out":83}
{"sheet":"Raw Data from FORECAST.ETS","index":7,"n_rows":111,"n_cols":6,"rows_kept":111,"cut":false,"hidden":false,"merged":[[0,9,0,10],[2,0,2,4]]}
[{"$f":"IF(ISERROR(RIGHT(CELL(\"filename\",A1),LEN(CELL(\"filename\",A1))-FIND(\"]\",CELL(\"filename\",A1)))),\n\"\",\nRIGHT(CELL(\"filename\",A1),LEN(CELL(\"filename\",A1))-FIND(\"]\",CELL(\"filename\",A1))))","v":"Raw Data from FORECAST.ETS"}]
[{"$f":"Model_Name","v":"SP Forecasting Examples.xlsm"}]
["Navigator"]
[null,null,null,"Error Checks:",null,{"$f":"Overall_Error_Check","v":0}]
[]
[{"$f":"MAX($B$5:$B5)+1","v":1},"Historical Information"]
[]
[null,"Key Inputs"]
[]
[]
["Date","Sales","Forecast(Sales)","Lower Confidence Bound(Sales)","Upper Confidence Bound(Sales)"]
["2012-09-30",2644539]
["2012-10-31",2359800]
["2012-11-30",2925918]
["2012-12-31",3024973]
["2013-01-31",3177100]
["2013-02-28",3419595]
["2013-03-31",3649702]
["2013-04-30",3650668]
["2013-05-31",3191526]
["2013-06-30",3249428]
["2013-07-31",2971484]
["2013-08-31",3074209]
["2013-09-30",2785466]
["2013-10-31",2515361]
["2013-11-30",3105958]
["2013-12-31",3139059]
["2014-01-31",3380355]
["2014-02-28",3612886]
["2014-03-31",3765824]
{"$rows_left_out":82}
{"sheet":"Model Parameters","index":8,"n_rows":31,"n_cols":9,"rows_kept":31,"cut":false,"hidden":false,"merged":[[0,9,0,10],[2,0,2,4],[10,6,10,13],[11,6,11,13]]}
[{"$f":"IF(ISERROR(RIGHT(CELL(\"filename\",A1),LEN(CELL(\"filename\",A1))-FIND(\"]\",CELL(\"filename\",A1)))),\n\"\",\nRIGHT(CELL(\"filename\",A1),LEN(CELL(\"filename\",A1))-FIND(\"]\",CELL(\"filename\",A1))))","v":"Model Parameters"}]
[{"$f":"Model_Name","v":"SP Forecasting Examples.xlsm"}]
["Navigator"]
[null,null,null,null,"Error Checks:",null,null,null,{"$f":"Overall_Error_Check","v":0}]
[]
[null,{"$f":"MAX($B$5:$B5)+1","v":1},"General"]
[]
[null,null,"Key Inputs"]
[]
[null,null,null,null,"General"]
[null,null,null,null,"Model Name",null,{"$f":"IF(ISERROR(OR(FIND(\"[\",CELL(\"filename\",A1)),FIND(\"]\",CELL(\"filename\",A1)))),\"\",MID(CELL(\"filename\",A1),FIND(\"[\",CELL(\"filename\",A1))+1,FIND(\"]\",CELL(\"filename\",A1))-FIND(\"[\",CELL(\"filename\",A1))-1))","v":"SP Forecasting Examples.xlsm"}]
[null,null,null,null,"Client Name",null,"ICAEW"]
[]
[]
[null,{"$f":"MAX($B$5:$B14)+1","v":2},"General Range Names"]
[]
[null,null,"Technical Assumptions"]
[]
[null,null,null,null,"Days in Year",null,365]
[null,null,null,null,"Months in Month",null,1]
[null,null,null,null,"Months in Quarter",null,3]
[null,null,null,null,"Months in Half Yr",null,6]
[null,null,null,null,"Months in Year",null,12]
[null,null,null,null,"Quarters in Year",null,4]
[]
[null,null,null,null,"Rounding Accuracy",null,5]
[]
[null,null,null,null,"Very Large Number",null,9.9999999999999997E+98]
[null,null,null,null,"Very Small Number",null,1E-8]
[]
{"$rows_left_out":2}
{"sheet":"Error Checks","index":9,"n_rows":17,"n_cols":9,"rows_kept":17,"cut":false,"hidden":false,"merged":[[0,8,0,9],[2,0,2,4]]}
[{"$f":"IF(ISERROR(RIGHT(CELL(\"filename\",A1),LEN(CELL(\"filename\",A1))-FIND(\"]\",CELL(\"filename\",A1)))),\n\"\",\nRIGHT(CELL(\"filename\",A1),LEN(CELL(\"filename\",A1))-FIND(\"]\",CELL(\"filename\",A1))))","v":"Error Checks"}]
[{"$f":"Model_Name","v":"SP Forecasting Examples.xlsm"}]
["Navigator"]
[null,"Error Checks:",null,null,null,{"$f":"Overall_Error_Check","v":0}]
[]
[null,{"$f":"MAX($B$5:$B5)+1","v":1},"Error Checks"]
[]
[null,null,"Summary of Errors"]
[]
[null,null,null,"Assumptions"]
[]
[null,null,null,null,"No checks in this model"]
[]
[]
[]
[]
[null,null,null,null,{"$f":"C8","v":"Summary of Errors"},null,null,null,{"$f":"MIN(1,SUM(I11:I15))","v":0}]